Target
Metallo-beta-lactamase type 2
Ligand
BDBM114408
Substrate
Meas. Tech.
ChEMBL_1567885 (CHEMBL3789280)
IC50
1230000±n/a nM
Citation
 Christopeit, TLeiros, HK Fragment-based discovery of inhibitor scaffolds targeting the metallo-ß-lactamases NDM-1 and VIM-2. Bioorg Med Chem Lett 26:1973-7 (2016)  
Target
Name:
Metallo-beta-lactamase type 2
Synonyms:
B2 metallo-beta-lactamase Beta-lactamase NDM-1 Metallo-beta-lactamase NDM-1 Metallo-beta-lactamase type II New Delhi metallo-beta-lactamase-1 | blaNDM-1
Type:
PROTEIN
Mol. Mass.:
28498.15
Organism:
Klebsiella pneumoniae
Description:
ChEMBL_103887
Residue:
270
  
Inhibitor
Name:
BDBM114408
Synonyms:
2-(7-chloranylquinolin-4-yl)sulfanylethanoic acid 2-[(7-chloro-4-quinolinyl)sulfanyl]acetic acid 2-[(7-chloro-4-quinolyl)thio]acetic acid SMR000456640 | cid_224672
Type:
Small organic molecule
Emp. Form.:
C11H8ClNO2S
Mol. Mass.:
253.705
SMILES:
OC(=O)CSc1ccnc2cc(Cl)ccc12
: