Target
Prostaglandin G/H synthase 2
Ligand
BDBM50161264
Substrate
Meas. Tech.
ChEMBL_1566201 (CHEMBL3788342)
IC50
610±n/a nM
Citation
 Abdel-Aziz, AAEl-Azab, ASAbou-Zeid, LAElTahir, KEAbdel-Aziz, NIAyyad, RRAl-Obaid, AM Synthesis, anti-inflammatory, analgesic and COX-1/2 inhibition activities of anilides based on 5,5-diphenylimidazolidine-2,4-dione scaffold: Molecular docking studies. Eur J Med Chem 115:121-31 (2016)  
Target
Name:
Prostaglandin G/H synthase 2
Synonyms:
COX2 Cyclooxygenase-2 (COX-2) PTGS2 Prostaglandin G/H synthase (cyclooxygenase)
Type:
Protein
Mol. Mass.:
68976.98
Organism:
Ovis aries (Sheep)
Description:
Residue:
603
  
Inhibitor
Name:
BDBM50161264
Synonyms:
CHEMBL3786688
Type:
Small organic molecule
Emp. Form.:
C27H27N3O6
Mol. Mass.:
489.5198
SMILES:
COc1cc(CNC(=O)CN2C(=O)NC(C2=O)(c2ccccc2)c2ccccc2)cc(OC)c1OC
: