Target
ATP-sensitive inward rectifier potassium channel 1
Ligand
BDBM50163355
Substrate
Meas. Tech.
ChEMBL_1571177 (CHEMBL3797008)
IC50
70±n/a nM
Citation
 Walsh, SPShahripour, ATang, Hde Jesus, RKTeumelsan, NZhu, YFrie, JPriest, BTSwensen, AMAlonso-Galicia, MFelix, JPBrochu, RMBailey, TThomas-Fowlkes, BZhou, XPai, LYHampton, CHernandez, MOwens, KEhrhart, JRoy, SKaczorowski, GJYang, LGarcia, MLPasternak, A Differentiation of ROMK potency from hERG potency in the phenacetyl piperazine series through heterocycle incorporation. Bioorg Med Chem Lett 26:2339-43 (2016)  
Target
Name:
ATP-sensitive inward rectifier potassium channel 1
Synonyms:
ATP-regulated potassium channel ROM-K Inward rectifier K(+) channel Kir1.1 KCNJ1_RAT Potassium channel (ATP modulatory) Renal Outer Medullary Potassium (ROMK) Romk1 | The Renal Outer Medullary Potassium (ROMK) channel (Kir1.1)
Type:
Enzyme
Mol. Mass.:
44976.27
Organism:
Rattus norvegicus (Rat)
Description:
P35560
Residue:
391
  
Inhibitor
Name:
BDBM50163355
Synonyms:
CHEMBL3793685
Type:
Small organic molecule
Emp. Form.:
C24H27N7O3
Mol. Mass.:
461.5163
SMILES:
Cc1nc(ccc1CC(=O)N1CCN(CCc2ccc3C(=O)OCc3c2C)CC1)-n1cnnn1
: