Target
Cyclin-dependent kinase 8
Ligand
BDBM50163768
Substrate
Meas. Tech.
ChEMBL_1572641 (CHEMBL3803436)
IC50
28±n/a nM
Citation
 Mallinger, ASchiemann, KRink, CStieber, FCalderini, MCrumpler, SStubbs, MAdeniji-Popoola, OPoeschke, OBusch, MCzodrowski, PMusil, DSchwarz, DOrtiz-Ruiz, MJSchneider, RThai, CValenti, Mde Haven Brandon, ABurke, RWorkman, PDale, TWienke, DClarke, PAEsdar, CRaynaud, FIEccles, SARohdich, FBlagg, J Discovery of Potent, Selective, and Orally Bioavailable Small-Molecule Modulators of the Mediator Complex-Associated Kinases CDK8 and CDK19. J Med Chem 59:1078-101 (2016)  
Target
Name:
Cyclin-dependent kinase 8
Synonyms:
CDK8 Cell division protein kinase 8 Mediator complex subunit CDK8 Protein kinase K35
Type:
Serine/threonine-protein kinase
Mol. Mass.:
53300.21
Organism:
Homo sapiens (Human)
Description:
P49336
Residue:
464
  
Inhibitor
Name:
BDBM50163768
Synonyms:
CHEMBL3798294
Type:
Small organic molecule
Emp. Form.:
C26H31ClN6O
Mol. Mass.:
479.017
SMILES:
CN(C)CCn1cc(cn1)-c1ccc(cc1)-c1cncc(Cl)c1N1CCC2(CCNC2=O)CC1
: