Target
Cyclin-C
Ligand
BDBM50163795
Substrate
Meas. Tech.
ChEMBL_1572664 (CHEMBL3803459)
IC50
4.9±n/a nM
Citation
 Mallinger, ASchiemann, KRink, CStieber, FCalderini, MCrumpler, SStubbs, MAdeniji-Popoola, OPoeschke, OBusch, MCzodrowski, PMusil, DSchwarz, DOrtiz-Ruiz, MJSchneider, RThai, CValenti, Mde Haven Brandon, ABurke, RWorkman, PDale, TWienke, DClarke, PAEsdar, CRaynaud, FIEccles, SARohdich, FBlagg, J Discovery of Potent, Selective, and Orally Bioavailable Small-Molecule Modulators of the Mediator Complex-Associated Kinases CDK8 and CDK19. J Med Chem 59:1078-101 (2016)  
Target
Name:
Cyclin-C
Synonyms:
CCNC Cyclin C hSRB11
Type:
PROTEIN
Mol. Mass.:
33244.88
Organism:
Homo sapiens (Human)
Description:
ChEMBL_107900
Residue:
283
  
Inhibitor
Name:
BDBM50163795
Synonyms:
CHEMBL3798382
Type:
Small organic molecule
Emp. Form.:
C21H23ClN6O
Mol. Mass.:
410.9
SMILES:
Cn1ncc2cc(ccc12)-c1cnc(N)c(Cl)c1N1CCC2(CCNC2=O)CC1
: