Target
Carbonic anhydrase 7
Ligand
BDBM50380148
Substrate
Meas. Tech.
ChEMBL_1572870 (CHEMBL3801006)
Kd
7.7±n/a nM
Citation
 Talibov, VOLinkuviene, VMatulis, DDanielson, UH Kinetically Selective Inhibitors of Human Carbonic Anhydrase Isozymes I, II, VII, IX, XII, and XIII. J Med Chem 59:2083-93 (2016)  
Target
Name:
Carbonic anhydrase 7
Synonyms:
CA-VII CAH7_HUMAN Carbonic anhydrase Carbonic anhydrase VII (CA VII)
Type:
Enzyme
Mol. Mass.:
29664.11
Organism:
Homo sapiens (Human)
Description:
Human cloned isozyme.
Residue:
264
  
Inhibitor
Name:
BDBM50380148
Synonyms:
CHEMBL2011156 | carbonic anhydrase (CA) inhibitors, benzenesulphonamide ligand, 6
Type:
Small organic molecule
Emp. Form.:
C12H11N3O3S2
Mol. Mass.:
309.364
SMILES:
NS(=O)(=O)c1ccc(cc1)C(=O)CSc1ncccn1
: