Target
Carbonic anhydrase 9
Ligand
BDBM50380148
Substrate
Meas. Tech.
ChEMBL_1572906 (CHEMBL3801229)
pH
7±n/a
Kd
80±n/a nM
Comments
extracted
Citation
 Talibov, VOLinkuviene, VMatulis, DDanielson, UH Kinetically Selective Inhibitors of Human Carbonic Anhydrase Isozymes I, II, VII, IX, XII, and XIII. J Med Chem 59:2083-93 (2016)  
Target
Name:
Carbonic anhydrase 9
Synonyms:
CA-IX CAH9_HUMAN Carbonic anhydrase 9 (CA IX) Carbonic anhydrase 9 precursor Carbonic anhydrase IX (CAIX) Carbonic anhydrases; II & IX MN RCC-associated antigen G250
Type:
Enzyme
Mol. Mass.:
49669.03
Organism:
Homo sapiens (Human)
Description:
Catalytic domain of human cloned isozyme was used in the assay
Residue:
459
  
Inhibitor
Name:
BDBM50380148
Synonyms:
CHEMBL2011156 | carbonic anhydrase (CA) inhibitors, benzenesulphonamide ligand, 6
Type:
Small organic molecule
Emp. Form.:
C12H11N3O3S2
Mol. Mass.:
309.364
SMILES:
NS(=O)(=O)c1ccc(cc1)C(=O)CSc1ncccn1
: