Target
Carbonic anhydrase 1
Ligand
BDBM50380148
Substrate
Meas. Tech.
ChEMBL_1572863 (CHEMBL3800999)
Kd
25±n/a nM
Citation
 Talibov, VOLinkuviene, VMatulis, DDanielson, UH Kinetically Selective Inhibitors of Human Carbonic Anhydrase Isozymes I, II, VII, IX, XII, and XIII. J Med Chem 59:2083-93 (2016)  
Target
Name:
Carbonic anhydrase 1
Synonyms:
CA-I CAB Carbonate dehydratase I Carbonic anhydrase 1 (CA I) Carbonic anhydrase 1 (Recombinant CA I) Carbonic anhydrase B Carbonic anhydrase I (CA I) Carbonic anhydrase I (CAI) Carbonic anhydrase isoenzyme I (hCA I) | hCA
Type:
Enzyme
Mol. Mass.:
28873.37
Organism:
Homo sapiens (Human)
Description:
P00915
Residue:
261
  
Inhibitor
Name:
BDBM50380148
Synonyms:
CHEMBL2011156 | carbonic anhydrase (CA) inhibitors, benzenesulphonamide ligand, 6
Type:
Small organic molecule
Emp. Form.:
C12H11N3O3S2
Mol. Mass.:
309.364
SMILES:
NS(=O)(=O)c1ccc(cc1)C(=O)CSc1ncccn1
: