Target
Carbonic anhydrase 12
Ligand
BDBM50380148
Substrate
Meas. Tech.
ChEMBL_1573083 (CHEMBL3802369)
pH
8±n/a
Kd
90±n/a nM
Comments
extracted
Citation
 Talibov, VOLinkuviene, VMatulis, DDanielson, UH Kinetically Selective Inhibitors of Human Carbonic Anhydrase Isozymes I, II, VII, IX, XII, and XIII. J Med Chem 59:2083-93 (2016)  
Target
Name:
Carbonic anhydrase 12
Synonyms:
CA-XII CAH12_HUMAN Carbonic anhydrase Carbonic anhydrase XII Carbonic anhydrase XII (CAXII) | Tumor antigen HOM-RCC-3.1.3
Type:
Enzyme
Mol. Mass.:
39456.00
Organism:
Homo sapiens (Human)
Description:
Catalytic domain of human cloned isozyme was used in the assay
Residue:
354
  
Inhibitor
Name:
BDBM50380148
Synonyms:
CHEMBL2011156 | carbonic anhydrase (CA) inhibitors, benzenesulphonamide ligand, 6
Type:
Small organic molecule
Emp. Form.:
C12H11N3O3S2
Mol. Mass.:
309.364
SMILES:
NS(=O)(=O)c1ccc(cc1)C(=O)CSc1ncccn1
: