Target
Sodium channel protein type 4 subunit alpha
Ligand
BDBM50164184
Substrate
Meas. Tech.
ChEMBL_1573826 (CHEMBL3803511)
IC50
70±n/a nM
Citation
 Murray, JKLong, JZou, ALigutti, JAndrews, KLPoppe, LBiswas, KMoyer, BDMcDonough, SIMiranda, LP Single Residue Substitutions That Confer Voltage-Gated Sodium Ion Channel Subtype Selectivity in the NaV1.7 Inhibitory Peptide GpTx-1. J Med Chem 59:2704-17 (2016)  
Target
Name:
Sodium channel protein type 4 subunit alpha
Synonyms:
SCN4A SkM1 Sodium channel protein skeletal muscle subunit alpha Sodium channel protein type IV alpha subunit Voltage-gated sodium channel subunit alpha Nav1.4 | Voltage-gated sodium channel subunit alpha Nav1.4 (Nav1.4)
Type:
Protein
Mol. Mass.:
208010.01
Organism:
Homo sapiens (Human)
Description:
P35499
Residue:
1836
  
Inhibitor
Name:
BDBM50164184
Synonyms:
CHEMBL3798824
Type:
Small organic molecule
Emp. Form.:
C180H273N53O44S7
Mol. Mass.:
4107.877
SMILES:
[H][C@@]12CCCN1C(=O)[C@H](CCCNC(N)=N)NC(=O)[C@]1([H])CSSC[C@H](NC(=O)[C@@H](N)CC(O)=O)C(=O)N[C@@H](CC(C)C)C(=O)NCC(=O)N[C@@H](Cc3ccccc3)C(=O)N[C@@H](CCSC)C(=O)N[C@@H](CCCNC(N)=N)C(=O)N[C@@H](CCCCN)C(=O)N[C@@]3([H])CSSC[C@]([H])(NC(=O)[C@@H](NC(=O)[C@H](CC(C)C)NC(=O)[C@H](CC(N)=O)NC2=O)C(C)C)C(=O)N[C@@H](CO)C(=O)N[C@@H](CCCNC(N)=N)C(=O)N[C@@]([H])([C@@H](C)O)C(=O)N[C@@H](Cc2cnc[nH]2)C(=O)N[C@@H](CCCCN)C(=O)N[C@@H](Cc2c[nH]c4ccccc24)C(=O)N[C@@H](CSSC[C@]([H])(NC(=O)[C@H](CCCCN)NC(=O)[C@H](CC(O)=O)NC(=O)[C@H](CC(N)=O)NC(=O)[C@H](CC(O)=O)NC(=O)[C@]2([H])CCCN2C(=O)[C@@]([H])(NC3=O)[C@@H](C)CC)C(=O)N1)C(=O)N[C@@H](CCCCN)C(=O)N[C@@H](Cc1cccc2ccccc12)C(=O)N[C@@H](C(C)C)C(=O)N[C@@H](Cc1ccccc1)C(N)=O
: