Target
Alkaline phosphatase, tissue-nonspecific isozyme
Ligand
BDBM50165143
Substrate
Meas. Tech.
ChEMBL_1572751 (CHEMBL3804260)
IC50
47060±n/a nM
Citation
 al-Rashida, MBatool, GSattar, AEjaz, SAKhan, SLecka, JSévigny, JHameed, AIqbal, J 2-Alkoxy-3-(sulfonylarylaminomethylene)-chroman-4-ones as potent and selective inhibitors of ectonucleotidases. Eur J Med Chem 115:484-94 (2016)  
Target
Name:
Alkaline phosphatase, tissue-nonspecific isozyme
Synonyms:
ALPL Alkaline phosphatase liver/bone/kidney isozyme PPBT_BOVIN Tissue non-specific alkaline phosphatase (TNAP)
Type:
Protein
Mol. Mass.:
57195.60
Organism:
Bos taurus (Cattle)
Description:
P09487
Residue:
524
  
Inhibitor
Name:
BDBM50165143
Synonyms:
CHEMBL3798555
Type:
Small organic molecule
Emp. Form.:
C19H20N2O5S
Mol. Mass.:
388.438
SMILES:
CC(C)OC1Oc2ccccc2C(=O)\C1=C/Nc1ccc(cc1)S(N)(=O)=O
: