Target
5'-nucleotidase
Ligand
BDBM50165143
Substrate
Meas. Tech.
ChEMBL_1572756 (CHEMBL3804265)
IC50
540±n/a nM
Citation
 al-Rashida, MBatool, GSattar, AEjaz, SAKhan, SLecka, JSévigny, JHameed, AIqbal, J 2-Alkoxy-3-(sulfonylarylaminomethylene)-chroman-4-ones as potent and selective inhibitors of ectonucleotidases. Eur J Med Chem 115:484-94 (2016)  
Target
Name:
5'-nucleotidase
Synonyms:
5'-nucleotidase Ecto-5'-nucleotidase (e5'NT) NT Nt5e | Nte
Type:
Enzyme
Mol. Mass.:
63971.44
Organism:
Rattus norvegicus (Rat)
Description:
P21588
Residue:
576
  
Inhibitor
Name:
BDBM50165143
Synonyms:
CHEMBL3798555
Type:
Small organic molecule
Emp. Form.:
C19H20N2O5S
Mol. Mass.:
388.438
SMILES:
CC(C)OC1Oc2ccccc2C(=O)\C1=C/Nc1ccc(cc1)S(N)(=O)=O
: