Target
5-hydroxytryptamine receptor 2A
Ligand
BDBM50165207
Substrate
Meas. Tech.
ChEMBL_1572988 (CHEMBL3801702)
Ki
0.600000±n/a nM
Citation
 Bielenica, AKedzierska, EKolinski, MKmiecik, SKolinski, AFiorino, FSeverino, BMagli, ECorvino, ARossi, IMassarelli, PKoziol, AESawczenko, AStruga, M 5-HT2 receptor affinity, docking studies and pharmacological evaluation of a series of 1,3-disubstituted thiourea derivatives. Eur J Med Chem 116:173-186 (2016)  
Target
Name:
5-hydroxytryptamine receptor 2A
Synonyms:
5-HT-2A 5-HT2A 5-hydroxytryptamine receptor 2A (5HT2A) Htr2 Serotonin Receptor 2A
Type:
G Protein-Coupled Receptor (GPCR)
Mol. Mass.:
52852.05
Organism:
Rattus norvegicus (rat)
Description:
Rat cortex membranes 5-HT2A receptors.
Residue:
471
  
Inhibitor
Name:
BDBM50165207
Synonyms:
CHEMBL1404528
Type:
Small organic molecule
Emp. Form.:
C15H13F3N2S
Mol. Mass.:
310.337
SMILES:
FC(F)(F)c1cccc(NC(S)=NCc2ccccc2)c1
: