Target
Leucine-rich repeat serine/threonine-protein kinase 2
Ligand
BDBM50165982
Substrate
Meas. Tech.
ChEMBL_1575145 (CHEMBL3804653)
Ki
3407±n/a nM
Citation
 Greshock, TJSanders, JMDrolet, RERajapakse, HAChang, RKKim, BRada, VLTiscia, HESu, HLai, MTSur, SMSanchez, RIBilodeau, MTRenger, JJKern, JTMcCauley, JA Potent, selective and orally bioavailable leucine-rich repeat kinase 2 (LRRK2) inhibitors. Bioorg Med Chem Lett 26:2631-5 (2016)  
Target
Name:
Leucine-rich repeat serine/threonine-protein kinase 2
Synonyms:
Dardarin LRRK2_HUMAN Leucine-rich repeat serine/threonine-protein kinase 2 PARK8
Type:
Protein
Mol. Mass.:
286113.20
Organism:
Homo sapiens (Human)
Description:
Q5S007
Residue:
2527
  
Inhibitor
Name:
BDBM50165982
Synonyms:
CHEMBL3800053
Type:
Small organic molecule
Emp. Form.:
C11H11N3OS2
Mol. Mass.:
265.355
SMILES:
CSc1sc(-c2cc[nH]n2)c2CCNC(=O)c12
: