Target
D(1A) dopamine receptor
Ligand
BDBM50167065
Substrate
Meas. Tech.
ChEMBL_1573520 (CHEMBL3801475)
Ki
210±n/a nM
Citation
 Weichert, DStanek, MHübner, HGmeiner, P Structure-guided development of dualß2 adrenergic/dopamine D2 receptor agonists. Bioorg Med Chem 24:2641-53 (2016)  
Target
Name:
D(1A) dopamine receptor
Synonyms:
DA D1 receptor DRD1 Dopamine D1 receptor Dopamine D1A
Type:
Enzyme
Mol. Mass.:
49303.43
Organism:
Homo sapiens (Human)
Description:
P21728
Residue:
446
  
Inhibitor
Name:
BDBM50167065
Synonyms:
CHEMBL3797758
Type:
Small organic molecule
Emp. Form.:
C17H21NO4
Mol. Mass.:
303.3529
SMILES:
COc1ccccc1OCCNCCc1ccc(O)c(O)c1
: