Target
D(4) dopamine receptor
Ligand
BDBM50167068
Substrate
Meas. Tech.
ChEMBL_1573524 (CHEMBL3801479)
Ki
1000±n/a nM
Citation
 Weichert, DStanek, MHübner, HGmeiner, P Structure-guided development of dualß2 adrenergic/dopamine D2 receptor agonists. Bioorg Med Chem 24:2641-53 (2016)  
Target
Name:
D(4) dopamine receptor
Synonyms:
D(2C) dopamine receptor DOPAMINE D4.2 DRD4 Dopamine D4 receptor
Type:
Enzyme
Mol. Mass.:
48373.19
Organism:
Homo sapiens (Human)
Description:
P21917
Residue:
419
  
Inhibitor
Name:
BDBM50167068
Synonyms:
CHEMBL3799427
Type:
Small organic molecule
Emp. Form.:
C26H31NO5
Mol. Mass.:
437.528
SMILES:
COc1cc(CCNC[C@@H](O)c2ccc(O)c(O)c2)ccc1OCCCc1ccccc1
: