Target
Beta-2 adrenergic receptor
Ligand
BDBM50167068
Substrate
Meas. Tech.
ChEMBL_1573529 (CHEMBL3801484)
EC50
2600±n/a nM
Citation
 Weichert, DStanek, MHübner, HGmeiner, P Structure-guided development of dualß2 adrenergic/dopamine D2 receptor agonists. Bioorg Med Chem 24:2641-53 (2016)  
Target
Name:
Beta-2 adrenergic receptor
Synonyms:
ADRB2 ADRB2_HUMAN Beta-2 adrenoceptor | Beta-2 adrenoreceptor
Type:
Mol. Mass.:
46461.69
Organism:
Homo sapiens (Human)
Description:
P07550
Residue:
413
  
Inhibitor
Name:
BDBM50167068
Synonyms:
CHEMBL3799427
Type:
Small organic molecule
Emp. Form.:
C26H31NO5
Mol. Mass.:
437.528
SMILES:
COc1cc(CCNC[C@@H](O)c2ccc(O)c(O)c2)ccc1OCCCc1ccccc1
: