Target
Catechol O-methyltransferase
Ligand
BDBM50167084
Substrate
Meas. Tech.
ChEMBL_1573539 (CHEMBL3801494)
IC50
27±n/a nM
Citation
 Zhao, ZHarrison, STSchubert, JWSanders, JMPolsky-Fisher, SZhang, NRMcLoughlin, DGibson, CRRobinson, RGSachs, NAKandebo, MYao, LSmith, SMHutson, PHWolkenberg, SEBarrow, JC Synthesis and optimization of N-heterocyclic pyridinones as catechol-O-methyltransferase (COMT) inhibitors. Bioorg Med Chem Lett 26:2952-2956 (2016)  
Target
Name:
Catechol O-methyltransferase
Synonyms:
COMT_RAT Catechol-O-methyltransferase | Comt
Type:
Enzyme
Mol. Mass.:
29594.09
Organism:
Rattus norvegicus (Rat)
Description:
Residue:
264
  
Inhibitor
Name:
BDBM50167084
Synonyms:
CHEMBL3798524
Type:
Small organic molecule
Emp. Form.:
C16H10Cl2N2O2
Mol. Mass.:
333.169
SMILES:
Oc1cn(ccc1=O)-c1cc(ccn1)-c1ccc(Cl)c(Cl)c1
: