Target
Adenosine receptor A2a
Ligand
BDBM50168104
Substrate
Meas. Tech.
ChEMBL_1575929 (CHEMBL3802552)
Ki
6.2±n/a nM
Citation
 Squarcialupi, LFalsini, MCatarzi, DVarano, FBetti, MVarani, KVincenzi, FDal Ben, DLambertucci, CVolpini, RColotta, V Exploring the 2- and 5-positions of the pyrazolo[4,3-d]pyrimidin-7-amino scaffold to target human A1 and A2A adenosine receptors. Bioorg Med Chem 24:2794-808 (2016)  
Target
Name:
Adenosine receptor A2a
Synonyms:
A2A adenosine receptor (hA2A) ADENOSINE A2 ADORA2 Adenosine A2A receptor (A2AAR)
Type:
G Protein-Coupled Receptor (GPCR)
Mol. Mass.:
44716.46
Organism:
Homo sapiens (Human)
Description:
P29274
Residue:
412
  
Inhibitor
Name:
BDBM50168104
Synonyms:
CHEMBL3799848
Type:
Small organic molecule
Emp. Form.:
C17H14ClN5O
Mol. Mass.:
339.779
SMILES:
Cc1ccc(o1)-c1nc(N)c2nn(Cc3ccccc3Cl)cc2n1
: