Target
Cathepsin B
Ligand
BDBM20097
Substrate
Meas. Tech.
ChEBML_1577550
pH
6±n/a
Ki
>330±n/a nM
Comments
extracted
Citation
 Schmitz, JLi, TBartz, UGütschow, M Cathepsin B Inhibitors: Combining Dipeptide Nitriles with an Occluding Loop Recognition Element by Click Chemistry. ACS Med Chem Lett 7:211-6 (2016)  
Target
Name:
Cathepsin B
Synonyms:
APP secretase CATB_HUMAN CTSB Cathepsin B light chain | Cathepsin B1
Type:
Enzyme
Mol. Mass.:
37819.69
Organism:
Homo sapiens (Human)
Description:
gi_63102437
Residue:
339
  
Inhibitor
Name:
BDBM20097
Synonyms:
dipeptide-derived nitrile, 18 | tert-butyl N-[(1S)-1-[(cyanomethyl)carbamoyl]-2-(furan-2-yl)ethyl]carbamate
Type:
Small organic molecule
Emp. Form.:
C14H19N3O4
Mol. Mass.:
293.3184
SMILES:
CC(C)(C)OC(=O)N[C@@H](Cc1ccco1)C(=O)NCC#N
: