Target
Sigma non-opioid intracellular receptor 1
Ligand
BDBM50170036
Substrate
Meas. Tech.
ChEMBL_1576906 (CHEMBL3806615)
Ki
1.4±n/a nM
Citation
 Cao, XChen, YZhang, YLan, YZhang, JXu, XQiu, YZhao, SLiu, XLiu, BFZhang, G Synthesis and Biological Evaluation of Novels1 Receptor Ligands for Treating Neuropathic Pain: 6-Hydroxypyridazinones. J Med Chem 59:2942-61 (2016)  
Target
Name:
Sigma non-opioid intracellular receptor 1
Synonyms:
OPRS1 SIGMAR1 Sigma non-opioid intracellular receptor 1 Sigma1-receptor Sterol isomerase-like protein
Type:
Protein
Mol. Mass.:
25307.17
Organism:
Cavia porcellus (Guinea pig)
Description:
Q60492
Residue:
223
  
Inhibitor
Name:
BDBM50170036
Synonyms:
CHEMBL3805396
Type:
Small organic molecule
Emp. Form.:
C18H21Cl2N3O2
Mol. Mass.:
382.284
SMILES:
Clc1ccc(cc1Cl)-n1nc(OCCCN2CCCCC2)ccc1=O
: