Target
Insulin-like growth factor 1 receptor
Ligand
BDBM50170077
Substrate
Meas. Tech.
ChEMBL_1577152 (CHEMBL3807414)
IC50
136±n/a nM
Citation
 Menichincheri, MArdini, EMagnaghi, PAvanzi, NBanfi, PBossi, RBuffa, LCanevari, GCeriani, LColombo, MCorti, LDonati, DFasolini, MFelder, EFiorelli, CFiorentini, FGalvani, AIsacchi, ABorgia, ALMarchionni, CNesi, MOrrenius, CPanzeri, APesenti, ERusconi, LSaccardo, MBVanotti, EPerrone, EOrsini, P Discovery of Entrectinib: A New 3-Aminoindazole As a Potent Anaplastic Lymphoma Kinase (ALK), c-ros Oncogene 1 Kinase (ROS1), and Pan-Tropomyosin Receptor Kinases (Pan-TRKs) inhibitor. J Med Chem 59:3392-408 (2016)  
Target
Name:
Insulin-like growth factor 1 receptor
Synonyms:
CD_antigen=CD221 IGF1R Insulin-like growth factor 1 receptor (IGF1R) Insulin-like growth factor 1 receptor alpha chain Insulin-like growth factor I receptor | Insulin-like growth factor receptor (IGFR)
Type:
Protein
Mol. Mass.:
154776.79
Organism:
Homo sapiens (Human)
Description:
P08069
Residue:
1367
  
Inhibitor
Name:
BDBM50170077
Synonyms:
CHEMBL3805214
Type:
Small organic molecule
Emp. Form.:
C32H36F2N6O2
Mol. Mass.:
574.664
SMILES:
C[C@H](c1ccc2[nH]nc(NC(=O)c3ccc(cc3NC3CCOCC3)N3CCN(C)CC3)c2c1)c1cc(F)cc(F)c1
: