Target
ALK tyrosine kinase receptor
Ligand
BDBM50170115
Substrate
Meas. Tech.
ChEMBL_1577003 (CHEMBL3806916)
IC50
181±n/a nM
Citation
 Menichincheri, MArdini, EMagnaghi, PAvanzi, NBanfi, PBossi, RBuffa, LCanevari, GCeriani, LColombo, MCorti, LDonati, DFasolini, MFelder, EFiorelli, CFiorentini, FGalvani, AIsacchi, ABorgia, ALMarchionni, CNesi, MOrrenius, CPanzeri, APesenti, ERusconi, LSaccardo, MBVanotti, EPerrone, EOrsini, P Discovery of Entrectinib: A New 3-Aminoindazole As a Potent Anaplastic Lymphoma Kinase (ALK), c-ros Oncogene 1 Kinase (ROS1), and Pan-Tropomyosin Receptor Kinases (Pan-TRKs) inhibitor. J Med Chem 59:3392-408 (2016)  
Target
Name:
ALK tyrosine kinase receptor
Synonyms:
ALK ALK_HUMAN CD_antigen: CD246
Type:
Protein
Mol. Mass.:
176453.10
Organism:
Homo sapiens (Human)
Description:
Q9UM73
Residue:
1620
  
Inhibitor
Name:
BDBM50170115
Synonyms:
CHEMBL3806045
Type:
Small organic molecule
Emp. Form.:
C32H37FN6O2
Mol. Mass.:
556.6736
SMILES:
CN1CCN(CC1)c1ccc(C(=O)Nc2n[nH]c3ccc(Cc4cc(F)ccc4C)cc23)c(NC2CCOCC2)c1
: