Target
Alpha-1A adrenergic receptor
Ligand
BDBM50172997
Substrate
Meas. Tech.
ChEMBL_1579180 (CHEMBL3812083)
IC50
2.7±n/a nM
Citation
 Zhao, FLi, JChen, YTian, YWu, CXie, YZhou, YWang, JXie, XLiu, H Design, Synthesis, and Biological Evaluation of Indoline and Indole Derivatives as Potent and Selectivea1A-Adrenoceptor Antagonists. J Med Chem 59:3826-39 (2016)  
Target
Name:
Alpha-1A adrenergic receptor
Synonyms:
ADA1A_HUMAN ADRA1C Alpha 1A-adrenoceptor Alpha adrenergic receptor 1a Alpha-adrenergic receptor 1c adrenergic Alpha1 | adrenergic Alpha1C
Type:
Cell-surface receptors
Mol. Mass.:
51511.67
Organism:
Homo sapiens (Human)
Description:
P35348
Residue:
466
  
Inhibitor
Name:
BDBM50172997
Synonyms:
CHEMBL3808726
Type:
Small organic molecule
Emp. Form.:
C25H31BrF3N3O4
Mol. Mass.:
574.431
SMILES:
CC(Cc1cc2CCN(CCCO)c2c(c1)C(N)=O)NCCOc1cc(Br)ccc1OCC(F)(F)F
: