Target
Cyclin-dependent kinase/G2/mitotic-specific cyclin- 1
Ligand
BDBM50174983
Substrate
Meas. Tech.
ChEMBL_1579821 (CHEMBL3812560)
IC50
>50000±n/a nM
Citation
 Lamie, PF RETRACTED: Design, synthesis, structure-activity relationship and kinase inhibitory activity of substituted 3-methyl-1-phenyl-1H-pyrazolo[3,4-d]pyrimidin-4-ones. Bioorg Med Chem Lett 26:3093-7 (2016)  
Target
Name:
Cyclin-dependent kinase/G2/mitotic-specific cyclin- 1
Synonyms:
CDK1/B CDK1/CyclinB Cyclin-Dependent Kinase 1 (CDK1) Cyclin-dependent kinase/G2/mitotic-specific cyclin 1 | cdk1
Type:
Protein Complex
Mol. Mass.:
Description:
CDK1/Cyclin B complexes were purified from insect cells co-infected with baculovirus vectors containing each of the components.
Components:
This complex has 2 components.
Component 1
Name:
Cyclin-dependent kinase 1
Synonyms:
CDC2 CDK1 CDKN1 Cell division protein kinase 1 P34CDC2 | p34 protein kinase
Type:
Enzyme Subunit
Mol. Mass.:
34101.08
Organism:
Homo sapiens (Human)
Description:
P06493
Residue:
297
  
Component 2
Name:
G2/mitotic-specific cyclin-B1
Synonyms:
CCNB CCNB1_HUMAN
Type:
Enzyme Subunit
Mol. Mass.:
48340.95
Organism:
Homo sapiens (Human)
Description:
P14635
Residue:
433
  
Inhibitor
Name:
BDBM50174983
Synonyms:
CHEMBL3809950
Type:
Small organic molecule
Emp. Form.:
C17H19N5O2
Mol. Mass.:
325.3651
SMILES:
Cc1nn(-c2ccccc2)c2nc(CN3CCOCC3)[nH]c(=O)c12
: