Target
Cyclin-dependent kinase 2/G1/S-specific cyclin-E1
Ligand
BDBM50174745
Substrate
Meas. Tech.
ChEMBL_1579822 (CHEMBL3812561)
IC50
>25000±n/a nM
Citation
 Lamie, PF RETRACTED: Design, synthesis, structure-activity relationship and kinase inhibitory activity of substituted 3-methyl-1-phenyl-1H-pyrazolo[3,4-d]pyrimidin-4-ones. Bioorg Med Chem Lett 26:3093-7 (2016)  
Target
Name:
Cyclin-dependent kinase 2/G1/S-specific cyclin-E1
Synonyms:
CDK2/CycE CDK2/E Cyclin-Dependent Kinase 2 (CDK2) Cyclin-dependent kinase 2/cyclin E1
Type:
Protein
Mol. Mass.:
Description:
Components:
This complex has 2 components.
Component 1
Name:
Cyclin-dependent kinase 2
Synonyms:
CDK2 CDK2_HUMAN Cell division protein kinase 2 Protein cereblon/Cyclin-dependent kinase 2 | p33 protein kinase
Type:
Enzyme Subunit
Mol. Mass.:
33938.17
Organism:
Homo sapiens (Human)
Description:
P24941
Residue:
298
  
Component 2
Name:
G1/S-specific cyclin-E1
Synonyms:
CCNE CCNE1_HUMAN
Type:
Enzyme Subunit
Mol. Mass.:
47073.17
Organism:
Homo sapiens (Human)
Description:
Residue:
410
  
Inhibitor
Name:
BDBM50174745
Synonyms:
CHEMBL3808480
Type:
Small organic molecule
Emp. Form.:
C17H17ClN4O3
Mol. Mass.:
360.795
SMILES:
CCOC(=O)Cn1c(CCl)nc2n(nc(C)c2c1=O)-c1ccccc1
: