Target
Tyrosine-protein kinase ABL1
Ligand
BDBM50174971
Substrate
Meas. Tech.
ChEMBL_1579834 (CHEMBL3812743)
IC50
>12500±n/a nM
Citation
 Lamie, PF RETRACTED: Design, synthesis, structure-activity relationship and kinase inhibitory activity of substituted 3-methyl-1-phenyl-1H-pyrazolo[3,4-d]pyrimidin-4-ones. Bioorg Med Chem Lett 26:3093-7 (2016)  
Target
Name:
Tyrosine-protein kinase ABL1
Synonyms:
ABL ABL1_HUMAN JTK7 Proto-oncogene tyrosine-protein kinase ABL1 Tyrosine-protein kinase ABL V-abl Abelson murine leukemia viral oncogene homolog 1 p150 | tyrosine-protein kinase ABL1 isoform a
Type:
Enzyme
Mol. Mass.:
122897.30
Organism:
Homo sapiens (Human)
Description:
P00519
Residue:
1130
  
Inhibitor
Name:
BDBM50174971
Synonyms:
CHEMBL3810338
Type:
Small organic molecule
Emp. Form.:
C22H22N4O2
Mol. Mass.:
374.4357
SMILES:
CCOCc1nc2n(nc(C)c2c(=O)n1Cc1ccccc1)-c1ccccc1
: