Target
Metabotropic glutamate receptor 4
Ligand
BDBM50325108
Substrate
Meas. Tech.
ChEMBL_1579015 (CHEMBL3810871)
EC50
20±n/a nM
Citation
 Gogliotti, RDBlobaum, ALMorrison, RMDaniels, JSSalovich, JMCheung, YYRodriguez, ALLoch, MTConn, PJLindsley, CWNiswender, CMHopkins, CR Discovery and characterization of a novel series of N-phenylsulfonyl-1H-pyrrole picolinamides as positive allosteric modulators of the metabotropic glutamate receptor 4 (mGlu4). Bioorg Med Chem Lett 26:2984-7 (2016)  
Target
Name:
Metabotropic glutamate receptor 4
Synonyms:
GPRC1D GRM4_HUMAN MGLUR4 Metabotropic glutamate receptor 4 (mGlu4) metabotropic glutamate 4
Type:
Protein
Mol. Mass.:
101899.95
Organism:
Homo sapiens (Human)
Description:
Q14833
Residue:
912
  
Inhibitor
Name:
BDBM50325108
Synonyms:
CHEMBL1223381 | N-(3-chloro-4-(N-(2-chlorophenyl)sulfamoyl)phenyl)picolinamide
Type:
Small organic molecule
Emp. Form.:
C18H13Cl2N3O3S
Mol. Mass.:
422.285
SMILES:
Clc1ccccc1NS(=O)(=O)c1ccc(NC(=O)c2ccccn2)cc1Cl
: