Target
Oxysterols receptor LXR-alpha
Ligand
BDBM50177011
Substrate
Meas. Tech.
ChEMBL_1582622 (CHEMBL3817030)
Ki
43±n/a nM
Citation
 Zheng, YZhuang, LFan, KYTice, CMZhao, WDong, CLotesta, SDLeftheris, KLindblom, PRLiu, ZShimada, JNoto, PBMeng, SHardy, AHoward, LKrosky, PGuo, JLipinski, KKandpal, GBukhtiyarov, YZhao, YLala, DVan Orden, RZhou, JChen, GWu, ZMcKeever, BMMcGeehan, GMGregg, REClaremon, DASingh, SB Discovery of a Novel, Orally Efficacious Liver X Receptor (LXR)ß Agonist. J Med Chem 59:3264-71 (2016)  
Target
Name:
Oxysterols receptor LXR-alpha
Synonyms:
LXRA Liver X receptor alpha Liver X receptor alpha (NR1H3) NR1H3 Nuclear orphan receptor LXR-alpha | Nuclear receptor subfamily 1 group H member 3
Type:
Enzyme Catalytic Domain
Mol. Mass.:
50403.85
Organism:
Homo sapiens (Human)
Description:
Q13133
Residue:
447
  
Inhibitor
Name:
BDBM50177011
Synonyms:
CHEMBL3815014 | US10144715, Compound 7-13
Type:
Small organic molecule
Emp. Form.:
C19H23F3N4O2S
Mol. Mass.:
428.472
SMILES:
CC(C)[C@@H]1CN(CCN1c1nccc(n1)C(F)(F)F)c1cccc(c1)S(C)(=O)=O
: