Target
Protein polybromo-1
Ligand
BDBM50158688
Substrate
Meas. Tech.
ChEMBL_1585834 (CHEMBL3821766)
Kd
<100±n/a nM
Citation
 Gerstenberger, BSTrzupek, JDTallant, CFedorov, OFilippakopoulos, PBrennan, PEFedele, VMartin, SPicaud, SRogers, CParikh, MTaylor, ASamas, BO'Mahony, ABerg, EPallares, GTorrey, ADTreiber, DKSamardjiev, IJNasipak, BTPadilla-Benavides, TWu, QImbalzano, ANNickerson, JABunnage, MEMüller, SKnapp, SOwen, DR Identification of a Chemical Probe for Family VIII Bromodomains through Optimization of a Fragment Hit. J Med Chem 59:4800-11 (2016)  
Target
Name:
Protein polybromo-1
Synonyms:
BAF180 PB1 PBRM1 hPB1
Type:
PROTEIN
Mol. Mass.:
192953.62
Organism:
Homo sapiens (Human)
Description:
ChEMBL_104264
Residue:
1689
  
Inhibitor
Name:
BDBM50158688
Synonyms:
CHEMBL3752911
Type:
Small organic molecule
Emp. Form.:
C19H19N3O2
Mol. Mass.:
321.3731
SMILES:
[H][C@@]12CN(c3ccccn3)[C@@]([H])(CN1\C=C\C(=O)c1ccccc1O)C2
: