Target
Protein polybromo-1
Ligand
BDBM50182280
Substrate
Meas. Tech.
ChEMBL_1585833 (CHEMBL3821765)
Kd
152±n/a nM
Citation
 Gerstenberger, BSTrzupek, JDTallant, CFedorov, OFilippakopoulos, PBrennan, PEFedele, VMartin, SPicaud, SRogers, CParikh, MTaylor, ASamas, BO'Mahony, ABerg, EPallares, GTorrey, ADTreiber, DKSamardjiev, IJNasipak, BTPadilla-Benavides, TWu, QImbalzano, ANNickerson, JABunnage, MEMüller, SKnapp, SOwen, DR Identification of a Chemical Probe for Family VIII Bromodomains through Optimization of a Fragment Hit. J Med Chem 59:4800-11 (2016)  
Target
Name:
Protein polybromo-1
Synonyms:
BAF180 PB1 PBRM1 hPB1
Type:
PROTEIN
Mol. Mass.:
192953.62
Organism:
Homo sapiens (Human)
Description:
ChEMBL_104264
Residue:
1689
  
Inhibitor
Name:
BDBM50182280
Synonyms:
CHEMBL3819245
Type:
Small organic molecule
Emp. Form.:
C19H20N4O2
Mol. Mass.:
336.3877
SMILES:
Oc1ccccc1C(=O)\C=C\N1CCc2c(C1)ncnc2NC1CC1
: