Target
Peregrin
Ligand
BDBM50182416
Substrate
Meas. Tech.
ChEMBL_1584538 (CHEMBL3820393)
Kd
270±n/a nM
Citation
 Zhu, JCaflisch, A Twenty Crystal Structures of Bromodomain and PHD Finger Containing Protein 1 (BRPF1)/Ligand Complexes Reveal Conserved Binding Motifs and Rare Interactions. J Med Chem 59:5555-61 (2016)  
Target
Name:
Peregrin
Synonyms:
BR140 BRPF1_HUMAN Peregrin | Protein Br140
Type:
PROTEIN
Mol. Mass.:
137524.47
Organism:
Homo sapiens (Human)
Description:
ChEMBL_108054
Residue:
1214
  
Inhibitor
Name:
BDBM50182416
Synonyms:
CHEMBL3818270
Type:
Small organic molecule
Emp. Form.:
C17H20N6O4S
Mol. Mass.:
404.444
SMILES:
CCOC(=O)Nc1cc(nn2c(C)nnc12)-c1ccc(C)cc1NS(C)(=O)=O
: