Target
Cyclin-dependent kinase 2
Ligand
BDBM50182493
Substrate
Meas. Tech.
ChEBML_1586011
IC50
>30000±n/a nM
Citation
 Zhao, JFang, LZhang, XLiang, YGou, S Synthesis and biological evaluation of new [1,2,4]triazolo[4,3-a]pyridine derivatives as potential c-Met inhibitors. Bioorg Med Chem 24:3483-93 (2016)  
Target
Name:
Cyclin-dependent kinase 2
Synonyms:
CDK2 CDK2_HUMAN Cell division protein kinase 2 Protein cereblon/Cyclin-dependent kinase 2 | p33 protein kinase
Type:
Enzyme Subunit
Mol. Mass.:
33938.17
Organism:
Homo sapiens (Human)
Description:
P24941
Residue:
298
  
Inhibitor
Name:
BDBM50182493
Synonyms:
CHEMBL3818247 | US9512121, 22
Type:
Small organic molecule
Emp. Form.:
C22H16FN7O2S
Mol. Mass.:
461.472
SMILES:
CN1C(=O)COc2c1cnc1ccc(Sc3nnc4c(F)cc(cn34)-c3cnn(C)c3)cc21
: