Target
Ephrin type-A receptor 1
Ligand
BDBM2579
Substrate
Meas. Tech.
ChEMBL_1586018 (CHEMBL3820482)
IC50
50±n/a nM
Citation
 Zhao, JFang, LZhang, XLiang, YGou, S Synthesis and biological evaluation of new [1,2,4]triazolo[4,3-a]pyridine derivatives as potential c-Met inhibitors. Bioorg Med Chem 24:3483-93 (2016)  
Target
Name:
Ephrin type-A receptor 1
Synonyms:
EPH EPH tyrosine kinase 1 EPHA1_HUMAN EPHT1 Ephrin type-A receptor 1 Erythropoietin-producing hepatoma receptor hEpha1
Type:
Enzyme
Mol. Mass.:
108128.04
Organism:
Homo sapiens (Human)
Description:
P21709
Residue:
976
  
Inhibitor
Name:
BDBM2579
Synonyms:
(2S,3R,4R,6R)-3-methoxy-2-methyl-4-(methylamino)-29-oxa-1,7,17-triazaoctacyclo[12.12.2.1^{2,6}.0^{7,28}.0^{8,13}.0^{15,19}.0^{20,27}.0^{21,26}]nonacosa-8(13),9,11,14(28),15(19),20(27),21(26),22,24-nonaen-16-one Staurosporin, 4 Staurosporine, 8 US9206188, Staurosporine | US9226923, Staurosporine
Type:
Small organic molecule
Emp. Form.:
C28H26N4O3
Mol. Mass.:
466.531
SMILES:
CN[C@@H]1C[C@H]2O[C@@](C)([C@@H]1OC)n1c3ccccc3c3c4CNC(=O)c4c4c5ccccc5n2c4c13
: