Target
Sodium-dependent serotonin transporter
Ligand
BDBM50182745
Substrate
Meas. Tech.
ChEMBL_1586517 (CHEMBL3821456)
Ki
4284±n/a nM
Citation
 Ofori, EZhu, XYEtukala, JRPeprah, KJordan, KRAdkins, AABricker, BAKang, HJHuang, XPRoth, BLAblordeppey, SY Design and synthesis of dual 5-HT1A and 5-HT7 receptor ligands. Bioorg Med Chem 24:3464-71 (2016)  
Target
Name:
Sodium-dependent serotonin transporter
Synonyms:
5-HT Transporter 5HTT SC6A4_HUMAN SLC6A4 Serotonin transporter (5HTT) Sodium-dependent serotonin transporter (SERT) | Solute carrier family 6 member 4
Type:
Multi-pass membrane protein
Mol. Mass.:
70322.51
Organism:
Homo sapiens (Human)
Description:
P31645
Residue:
630
  
Inhibitor
Name:
BDBM50182745
Synonyms:
CHEMBL3818128
Type:
Small organic molecule
Emp. Form.:
C19H23ClFN
Mol. Mass.:
319.844
SMILES:
Cl.Fc1ccc(CCCCN2CCc3ccccc3C2)cc1
: