Target
5-hydroxytryptamine receptor 2C
Ligand
BDBM50182745
Substrate
Meas. Tech.
ChEMBL_1586512 (CHEMBL3821451)
Ki
4440±n/a nM
Citation
 Ofori, EZhu, XYEtukala, JRPeprah, KJordan, KRAdkins, AABricker, BAKang, HJHuang, XPRoth, BLAblordeppey, SY Design and synthesis of dual 5-HT1A and 5-HT7 receptor ligands. Bioorg Med Chem 24:3464-71 (2016)  
Target
Name:
5-hydroxytryptamine receptor 2C
Synonyms:
5-HT2C 5-hydroxytryptamine receptor 2C (5HT2c) 5ht1c Htr2c Serotonin receptor 2a and 2c (5HT2A and 5HT2C)
Type:
Enzyme
Mol. Mass.:
51935.10
Organism:
Rattus norvegicus (Rat)
Description:
P08909
Residue:
460
  
Inhibitor
Name:
BDBM50182745
Synonyms:
CHEMBL3818128
Type:
Small organic molecule
Emp. Form.:
C19H23ClFN
Mol. Mass.:
319.844
SMILES:
Cl.Fc1ccc(CCCCN2CCc3ccccc3C2)cc1
: