Target
D(4) dopamine receptor
Ligand
BDBM50182745
Substrate
Meas. Tech.
ChEMBL_1586515 (CHEMBL3821454)
Ki
158±n/a nM
Citation
 Ofori, EZhu, XYEtukala, JRPeprah, KJordan, KRAdkins, AABricker, BAKang, HJHuang, XPRoth, BLAblordeppey, SY Design and synthesis of dual 5-HT1A and 5-HT7 receptor ligands. Bioorg Med Chem 24:3464-71 (2016)  
Target
Name:
D(4) dopamine receptor
Synonyms:
D(4) dopamine receptor DOPAMINE D4.4 Dopamine receptor | Drd4
Type:
Enzyme Catalytic Domain
Mol. Mass.:
41307.65
Organism:
RAT
Description:
DOPAMINE D4.4 0 RAT::P30729
Residue:
387
  
Inhibitor
Name:
BDBM50182745
Synonyms:
CHEMBL3818128
Type:
Small organic molecule
Emp. Form.:
C19H23ClFN
Mol. Mass.:
319.844
SMILES:
Cl.Fc1ccc(CCCCN2CCc3ccccc3C2)cc1
: