Target
Dual specificity protein kinase TTK
Ligand
BDBM50081539
Substrate
Meas. Tech.
ChEMBL_1586344 (CHEMBL3820514)
IC50
1.000000±n/a nM
Citation
 Laufer, RLi, SWLiu, YNg, GLang, YFeher, MBrokx, RBeletskaya, IHodgson, RMao, GPlotnikova, OAwrey, DEMason, JMWei, XLin, DCChe, YKiarash, RMadeira, BFletcher, GCMak, TWBray, MRPauls, HW Discovery of 4-(4-aminopyrazolo[1,5-a][1,3,5]triazin-8-yl)benzamides as novel, highly potent and selective, orally bioavailable inhibitors of Tyrosine Threonine Kinase, TTK. Bioorg Med Chem Lett 26:3562-6 (2016)  
Target
Name:
Dual specificity protein kinase TTK
Synonyms:
Dual specificity protein kinase (TTK) MPS1 Monopolar Spindle 1 (MPS1) Monopolar Spindle 1 Kinase (MPS1) TTK | TTK_HUMAN
Type:
Protein
Mol. Mass.:
97086.79
Organism:
Homo sapiens (Human)
Description:
P33981
Residue:
857
  
Inhibitor
Name:
BDBM50081539
Synonyms:
CHEMBL3422104
Type:
Small organic molecule
Emp. Form.:
C29H28N6O
Mol. Mass.:
476.5722
SMILES:
CC(C)CNc1nc(cn2c(cnc12)-c1ccc(cc1)C(=O)NC1CC1)-c1cccc2ncccc12
: