Target
Dual specificity protein kinase TTK
Ligand
BDBM50183022
Substrate
Meas. Tech.
ChEMBL_1586153 (CHEMBL3821249)
IC50
0.700000±n/a nM
Citation
 Laufer, RLi, SWLiu, YNg, GLang, YFeher, MBrokx, RBeletskaya, IHodgson, RMao, GPlotnikova, OAwrey, DEMason, JMWei, XLin, DCChe, YKiarash, RMadeira, BFletcher, GCMak, TWBray, MRPauls, HW Discovery of 4-(4-aminopyrazolo[1,5-a][1,3,5]triazin-8-yl)benzamides as novel, highly potent and selective, orally bioavailable inhibitors of Tyrosine Threonine Kinase, TTK. Bioorg Med Chem Lett 26:3562-6 (2016)  
Target
Name:
Dual specificity protein kinase TTK
Synonyms:
Dual specificity protein kinase (TTK) MPS1 Monopolar Spindle 1 (MPS1) Monopolar Spindle 1 Kinase (MPS1) TTK | TTK_HUMAN
Type:
Protein
Mol. Mass.:
97086.79
Organism:
Homo sapiens (Human)
Description:
P33981
Residue:
857
  
Inhibitor
Name:
BDBM50183022
Synonyms:
CHEMBL3819019
Type:
Small organic molecule
Emp. Form.:
C28H30FN7O2
Mol. Mass.:
515.5819
SMILES:
Cc1cc(ccc1C(=O)NC1CC1)-c1cnn2c(NCC3CCOCC3)nc(Nc3cccc(F)c3)nc12
: