Target
Glucagon-like peptide 2 receptor
Ligand
BDBM50183939
Substrate
Meas. Tech.
ChEMBL_1586856 (CHEMBL3824476)
EC50
0.190000±n/a nM
Citation
 Wisniewski, KSueiras-Diaz, JJiang, GGalyean, RLu, MThompson, DWang, YCCroston, GPosch, AHargrove, DMWisniewska, HLaporte, RDwyer, JJQi, SSrinivasan, KHartwig, JFerdyan, NMares, MKraus, JAlagarsamy, SRivière, PJSchteingart, CD Synthesis and Pharmacological Characterization of Novel Glucagon-like Peptide-2 (GLP-2) Analogues with Low Systemic Clearance. J Med Chem 59:3129-39 (2016)  
Target
Name:
Glucagon-like peptide 2 receptor
Synonyms:
GLP-2 receptor GLP-2R GLP2R_HUMAN
Type:
PROTEIN
Mol. Mass.:
63023.90
Organism:
Homo sapiens (Human)
Description:
ChEMBL_876141
Residue:
553
  
Inhibitor
Name:
BDBM50183939
Synonyms:
CHEMBL3822971
Type:
Small organic molecule
Emp. Form.:
C151H232N42O48
Mol. Mass.:
3403.7104
SMILES:
CCCCC(NC(=O)[C@H](CCC(O)=O)NC(=O)[C@H](CC(O)=O)NC(=O)[C@@H](CO)NC(=O)[C@H](Cc1ccccc1)NC(=O)[C@H](CO)NC(=O)CNC(=O)[C@H](CC(O)=O)NC(=O)CNC(=O)[C@@H](N)Cc1cnc[nH]1)C(=O)N[C@@H](CC(N)=O)C(=O)N[C@@H]([C@@H](C)O)C(=O)N[C@@H]([C@@H](C)CC)C(=O)N[C@@H](CC(C)C)C(=O)N[C@@H](CC(O)=O)C(=O)N[C@@H](CC(N)=O)C(=O)N[C@@H](CC(C)C)C(=O)N[C@@H](C)C(=O)N[C@@H](C)C(=O)N[C@@H](CCCNC(N)=N)C(=O)N[C@@H](CC(O)=O)C(=O)N[C@@H](Cc1ccccc1)C(=O)N[C@@H]([C@@H](C)CC)C(=O)N[C@@H](CC(N)=O)C(=O)N[C@@H](Cc1c[nH]c2ccccc12)C(=O)N[C@@H](CC(C)C)C(=O)N[C@@H]([C@@H](C)CC)C(=O)N[C@@H](CCC(N)=O)C(=O)N[C@@H]([C@@H](C)O)C(=O)N[C@@H](CCCCN)C(N)=O
: