Target
Transcription activator BRG1
Ligand
BDBM50184981
Substrate
Meas. Tech.
ChEMBL_1588201 (CHEMBL3825727)
Kd
2030±n/a nM
Citation
 Sutherell, CLTallant, CMonteiro, OPYapp, CFuchs, JEFedorov, OSiejka, PMüller, SKnapp, SBrenton, JDBrennan, PELey, SV Identification and Development of 2,3-Dihydropyrrolo[1,2-a]quinazolin-5(1H)-one Inhibitors Targeting Bromodomains within the Switch/Sucrose Nonfermenting Complex. J Med Chem 59:5095-101 (2016)  
Target
Name:
Transcription activator BRG1
Synonyms:
ATP-dependent helicase SMARCA4 BRG1 Mitotic growth and transcription activator Protein brahma homolog 1 SMCA4_HUMAN SNF2B SWI/SNF-related matrix-associated actin-dependent regulator of chromatin subfamily A member 4
Type:
PROTEIN
Mol. Mass.:
184666.66
Organism:
Homo sapiens (Human)
Description:
ChEMBL_107968
Residue:
1647
  
Inhibitor
Name:
BDBM50184981
Synonyms:
CHEMBL3823055
Type:
Small organic molecule
Emp. Form.:
C17H19ClN2O
Mol. Mass.:
302.799
SMILES:
CCC(CC)\C=C1/CCn2c1nc(=O)c1c(Cl)cccc21
: