Target
Heat shock cognate 71 kDa protein
Ligand
BDBM50049820
Substrate
Meas. Tech.
ChEMBL_1588265 (CHEMBL3825930)
Kd
3236±n/a nM
Citation
 Cheeseman, MDWestwood, IMBarbeau, ORowlands, MDobson, SJones, AMJeganathan, FBurke, RKadi, NWorkman, PCollins, Ivan Montfort, RLJones, K Exploiting Protein Conformational Change to Optimize Adenosine-Derived Inhibitors of HSP70. J Med Chem 59:4625-36 (2016)  
Target
Name:
Heat shock cognate 71 kDa protein
Synonyms:
HSC70 HSP7C_HUMAN HSPA8 heat shock 70kDa protein 8 isoform 2
Type:
Enzyme Catalytic Domain
Mol. Mass.:
70887.67
Organism:
Homo sapiens (Human)
Description:
gi_5729877
Residue:
646
  
Inhibitor
Name:
BDBM50049820
Synonyms:
4-Amino-5-carboxamide-7-(D-ribofuranosyl)pyrrolo[2,3-d]pyrimidine 4-Amino-7-(3,4-dihydroxy-5-hydroxymethyl-tetrahydro-furan-2-yl)-7H-pyrrolo[2,3-d]pyrimidine-5-carboxylic acid amide CHEMBL101892 cid_5153
Type:
Small organic molecule
Emp. Form.:
C12H15N5O5
Mol. Mass.:
309.278
SMILES:
NC(=O)c1cn([C@@H]2O[C@H](CO)[C@@H](O)[C@H]2O)c2ncnc(N)c12
: