Target
Insulin receptor
Ligand
BDBM50185163
Substrate
Meas. Tech.
ChEMBL_1587418 (CHEMBL3824711)
IC50
3.4±n/a nM
Citation
 Huang, WSLiu, SZou, DThomas, MWang, YZhou, TRomero, JKohlmann, ALi, FQi, JCai, LDwight, TAXu, YXu, RDodd, RToms, AParillon, LLu, XAnjum, RZhang, SWang, FKeats, JWardwell, SDNing, YXu, QMoran, LEMohemmad, QKJang, HGClackson, TNarasimhan, NIRivera, VMZhu, XDalgarno, DShakespeare, WC Discovery of Brigatinib (AP26113), a Phosphine Oxide-Containing, Potent, Orally Active Inhibitor of Anaplastic Lymphoma Kinase. J Med Chem 59:4948-64 (2016)  
Target
Name:
Insulin receptor
Synonyms:
INSR INSR_HUMAN Insulin receptor beta subunit
Type:
Receptor Tyrosine Kinase
Mol. Mass.:
156322.60
Organism:
Homo sapiens (Human)
Description:
P06213
Residue:
1382
  
Inhibitor
Name:
BDBM50185163
Synonyms:
CHEMBL3824246
Type:
Small organic molecule
Emp. Form.:
C28H35ClN8O2
Mol. Mass.:
551.083
SMILES:
COc1cc(ccc1Nc1ncc(Cl)c(Nc2ccccc2C(N)=O)n1)N1CCC(CC1)N1CCN(C)CC1
: