Target
Fatty acid-binding protein, adipocyte
Ligand
BDBM50187487
Substrate
Meas. Tech.
ChEMBL_1589882 (CHEMBL3830762)
Ki
610±n/a nM
Citation
 Zhou, YNie, TZhang, YSong, MLi, KDing, MDing, KWu, DXu, Y The discovery of novel and selective fatty acid binding protein 4 inhibitors by virtual screening and biological evaluation. Bioorg Med Chem 24:4310-4317 (2016)  
Target
Name:
Fatty acid-binding protein, adipocyte
Synonyms:
A-FABP ALBP FABP4 Fatty acid binding protein adipocyte Fatty acid-binding protein 4 (FABP4)
Type:
Enzyme
Mol. Mass.:
14719.23
Organism:
Homo sapiens (Human)
Description:
P15090
Residue:
132
  
Inhibitor
Name:
BDBM50187487
Synonyms:
CHEMBL3827900
Type:
Small organic molecule
Emp. Form.:
C21H23NO2
Mol. Mass.:
321.4128
SMILES:
Cc1cc(C)c2C3C=CCC3C(N3CC4CC=CC4c1c23)C(O)=O
: