Target
Leukocyte tyrosine kinase receptor
Ligand
BDBM50187716
Substrate
Meas. Tech.
ChEMBL_1589280 (CHEMBL3830308)
IC50
43±n/a nM
Citation
 Song, ZXia, ZJi, YXing, LGao, YAi, JGeng, MZhang, A An orally available tyrosine kinase ALK and RET dual inhibitor bearing the tetracyclic benzo[b]carbazolone core. Eur J Med Chem 118:244-9 (2016)  
Target
Name:
Leukocyte tyrosine kinase receptor
Synonyms:
LTK TYK1
Type:
PROTEIN
Mol. Mass.:
91679.76
Organism:
Homo sapiens (Human)
Description:
ChEMBL_586334
Residue:
864
  
Inhibitor
Name:
BDBM50187716
Synonyms:
CHEMBL3735648
Type:
Small organic molecule
Emp. Form.:
C30H33N3O2
Mol. Mass.:
467.6019
SMILES:
CC1(C)c2[nH]c3cc(ccc3c2C(=O)c2ccc(cc12)C1CCN(CC2CCOCC2)CC1)C#N
: