Target
Epidermal growth factor receptor
Ligand
BDBM50187718
Substrate
Meas. Tech.
ChEMBL_1589608 (CHEMBL3829377)
IC50
44±n/a nM
Citation
 Hou, JWan, SWang, GZhang, TLi, ZTian, YYu, YWu, XZhang, J Design, synthesis, anti-tumor activity, and molecular modeling of quinazoline and pyrido[2,3-d]pyrimidine derivatives targeting epidermal growth factor receptor. Eur J Med Chem 118:276-89 (2016)  
Target
Name:
Epidermal growth factor receptor
Synonyms:
EGF Receptor Substrate EGFR_HUMAN ERBB1 Epidermal Growth Factor Receptor erbB-1 Epidermal growth factor receptor (EGFR) HER1 Proto-oncogene c-ErbB-1 Tyrosine-Protein Kinase ErbB-1
Type:
Receptor Kinase Domain
Mol. Mass.:
134279.59
Organism:
Homo sapiens (Human)
Description:
P00533
Residue:
1210
  
Inhibitor
Name:
BDBM50187718
Synonyms:
CHEMBL3828079
Type:
Small organic molecule
Emp. Form.:
C21H16N6
Mol. Mass.:
352.3919
SMILES:
Cn1cc(cn1)-c1ccc2ncnc(Nc3ccc4ncccc4c3)c2c1
: