Target
Receptor tyrosine-protein kinase erbB-2
Ligand
BDBM50187719
Substrate
Meas. Tech.
ChEMBL_1589611 (CHEMBL3829380)
IC50
590±n/a nM
Citation
 Hou, JWan, SWang, GZhang, TLi, ZTian, YYu, YWu, XZhang, J Design, synthesis, anti-tumor activity, and molecular modeling of quinazoline and pyrido[2,3-d]pyrimidine derivatives targeting epidermal growth factor receptor. Eur J Med Chem 118:276-89 (2016)  
Target
Name:
Receptor tyrosine-protein kinase erbB-2
Synonyms:
2.7.10.1 CD_antigen=CD340 ERBB2_HUMAN FASN/HER2 HER2 MLN19 NEU Proto-oncogene Neu Tyrosine kinase-type cell surface receptor HER2 | p185erbB2
Type:
Mol. Mass.:
137894.47
Organism:
Homo sapiens (Human)
Description:
P04626
Residue:
1255
  
Inhibitor
Name:
BDBM50187719
Synonyms:
CHEMBL3828021
Type:
Small organic molecule
Emp. Form.:
C20H15N5
Mol. Mass.:
325.3666
SMILES:
Cn1cc(cn1)-c1ccc2ncnc(Nc3cccc(c3)C#C)c2c1
: