Target
Receptor tyrosine-protein kinase erbB-2
Ligand
BDBM50187721
Substrate
Meas. Tech.
ChEMBL_1589611 (CHEMBL3829380)
IC50
1202±n/a nM
Citation
 Hou, JWan, SWang, GZhang, TLi, ZTian, YYu, YWu, XZhang, J Design, synthesis, anti-tumor activity, and molecular modeling of quinazoline and pyrido[2,3-d]pyrimidine derivatives targeting epidermal growth factor receptor. Eur J Med Chem 118:276-89 (2016)  
Target
Name:
Receptor tyrosine-protein kinase erbB-2
Synonyms:
2.7.10.1 CD_antigen=CD340 ERBB2_HUMAN FASN/HER2 HER2 MLN19 NEU Proto-oncogene Neu Tyrosine kinase-type cell surface receptor HER2 | p185erbB2
Type:
Mol. Mass.:
137894.47
Organism:
Homo sapiens (Human)
Description:
P04626
Residue:
1255
  
Inhibitor
Name:
BDBM50187721
Synonyms:
CHEMBL3828092
Type:
Small organic molecule
Emp. Form.:
C22H20ClFN6
Mol. Mass.:
422.886
SMILES:
Fc1ccc(Nc2ncnc3ccc(cc23)-c2cnn(c2)C2CCNCC2)cc1Cl
: