Target
Receptor tyrosine-protein kinase erbB-4
Ligand
BDBM50187722
Substrate
Meas. Tech.
ChEMBL_1589612 (CHEMBL3829381)
IC50
1100±n/a nM
Citation
 Hou, JWan, SWang, GZhang, TLi, ZTian, YYu, YWu, XZhang, J Design, synthesis, anti-tumor activity, and molecular modeling of quinazoline and pyrido[2,3-d]pyrimidine derivatives targeting epidermal growth factor receptor. Eur J Med Chem 118:276-89 (2016)  
Target
Name:
Receptor tyrosine-protein kinase erbB-4
Synonyms:
ERBB4 Epidermal growth factor receptor ErbB-4 (HER4) Tyrosine Kinase Proto-oncogene c-ErbB-4 Receptor protein-tyrosine kinase erbB-4 Tyrosine kinase-type cell surface receptor HER4 (HER4)
Type:
Protein
Mol. Mass.:
146803.56
Organism:
Homo sapiens (Human)
Description:
Q15303
Residue:
1308
  
Inhibitor
Name:
BDBM50187722
Synonyms:
CHEMBL3827349
Type:
Small organic molecule
Emp. Form.:
C25H23N7
Mol. Mass.:
421.497
SMILES:
C1CC(CCN1)n1cc(cn1)-c1ccc2ncnc(Nc3ccc4ncccc4c3)c2c1
: