Target
Endoplasmic reticulum aminopeptidase 2
Ligand
BDBM50170896
Substrate
Meas. Tech.
ChEBML_1591204
Ki
10300±n/a nM
Citation
 Weglarz-Tomczak, EVassiliou, SMucha, A Discovery of potent and selective inhibitors of human aminopeptidases ERAP1 and ERAP2 by screening libraries of phosphorus-containing amino acid and dipeptide analogues. Bioorg Med Chem Lett 26:4122-6 (2016)  
Target
Name:
Endoplasmic reticulum aminopeptidase 2
Synonyms:
Aminopeptidase ERAP2_HUMAN | LRAP
Type:
PROTEIN
Mol. Mass.:
110463.90
Organism:
Homo sapiens (Human)
Description:
ChEMBL_1473169
Residue:
960
  
Inhibitor
Name:
BDBM50170896
Synonyms:
CHEMBL3805251
Type:
Small organic molecule
Emp. Form.:
C8H20N3O3P
Mol. Mass.:
237.2365
SMILES:
NC(CNC1CCCCC1N)P(O)(O)=O
: